BDBM85825 CAS_219019::NSC_219019::OPC-28326
SMILES CCC(=O)Nc1c(C)cc(cc1C)C(=O)N1CCC(CC1)N(C)CCc1ccccc1
InChI Key InChIKey=BESKMDLUOAVUJF-UHFFFAOYSA-N
Data  2 KI
  Tab Delimited (TSV)   2D SDfile   Computed 3D by Vconf -m prep SDfile
Find this compound or compounds like it in BindingDB:
Activity Spreadsheet -- Enzyme Inhibition Constant Data from BindingDB
Found 1 hit for monomerid = 85825
TargetAlpha-2A adrenergic receptor [16-465](Rattus norvegicus (rat))
Otsuka Maryland Research Institute
Curated by PDSP Ki Database
LigandPNGBDBM85825(CAS_219019 | NSC_219019 | OPC-28326)
Affinity DataKi:  3.84E+3nM
In DepthDetails PubMed